Information card for entry 7033684
Formula | C26 H20 N4 O18 Tb2 |
Calculated formula | C26 H20 N4 O18 Tb2 |
Title of publication | Two series of reactant's ratio-dependent lanthanide organic frameworks derived from nicotinic acid N-oxide and oxalate: synthesis, crystal structures and luminescence properties. |
Authors of publication | Yu, Yanyan; Zhang, Lijuan; Zhou, Yunshan; Zuhra, Zareen |
Journal of publication | Dalton transactions (Cambridge, England : 2003) |
Year of publication | 2015 |
Journal volume | 44 |
Journal issue | 10 |
Pages of publication | 4601 - 4612 |
a | 8.2954 ± 0.0004 Å |
b | 9.7473 ± 0.0005 Å |
c | 9.8872 ± 0.0006 Å |
α | 101.508 ± 0.005° |
β | 108.666 ± 0.005° |
γ | 101.022 ± 0.004° |
Cell volume | 713.62 ± 0.08 Å3 |
Cell temperature | 102.5 K |
Ambient diffraction temperature | 102.5 K |
Number of distinct elements | 5 |
Space group number | 2 |
Hermann-Mauguin space group symbol | P -1 |
Hall space group symbol | -P 1 |
Residual factor for all reflections | 0.0292 |
Residual factor for significantly intense reflections | 0.0273 |
Weighted residual factors for significantly intense reflections | 0.0637 |
Weighted residual factors for all reflections included in the refinement | 0.0648 |
Goodness-of-fit parameter for all reflections included in the refinement | 1.095 |
Diffraction radiation wavelength | 0.71073 Å |
Diffraction radiation type | MoKα |