Information card for entry 7033702
Formula | C40 H32.2 Cl1.8 O3 P2 Ru |
Calculated formula | C40 H32.2 Cl1.8 O3 P2 Ru |
Title of publication | Organometallic chemistry of ethynyl boronic acid MIDA ester, HC[triple bond, length as m-dash]CB(O2CCH2)2NMe. |
Authors of publication | Hill, Anthony F.; Stewart, Craig D.; Ward, Jas S. |
Journal of publication | Dalton transactions (Cambridge, England : 2003) |
Year of publication | 2015 |
Journal volume | 44 |
Journal issue | 12 |
Pages of publication | 5713 - 5726 |
a | 17.0407 ± 0.0005 Å |
b | 11.2086 ± 0.0003 Å |
c | 19.6906 ± 0.0005 Å |
α | 90° |
β | 103.401 ± 0.0014° |
γ | 90° |
Cell volume | 3658.54 ± 0.17 Å3 |
Cell temperature | 200 K |
Ambient diffraction temperature | 200 K |
Number of distinct elements | 6 |
Space group number | 15 |
Hermann-Mauguin space group symbol | C 1 2/c 1 |
Hall space group symbol | -C 2yc |
Residual factor for all reflections | 0.1179 |
Residual factor for significantly intense reflections | 0.0472 |
Weighted residual factors for all reflections | 0.0965 |
Weighted residual factors for significantly intense reflections | 0.0804 |
Weighted residual factors for all reflections included in the refinement | 0.0965 |
Goodness-of-fit parameter for all reflections included in the refinement | 0.9387 |
Diffraction radiation wavelength | 0.71073 Å |
Diffraction radiation type | MoKα |