Information card for entry 7033721
Formula | C30 H31 Fe N4 O3 S2 |
Calculated formula | C30 H31 Fe N4 O3 S2 |
SMILES | c12ccc3ccccc3c1C=[N]1CC[NH]3CCC[N]4=Cc5c6ccccc6ccc5O[Fe]134(N=C=S)O2.CS(C)=O |
Title of publication | The relationship between the strength of hydrogen bonding and spin crossover behaviour in a series of iron(iii) Schiff base complexes. |
Authors of publication | Nemec, Ivan; Herchel, Radovan; Trávníček, Zdeněk |
Journal of publication | Dalton transactions (Cambridge, England : 2003) |
Year of publication | 2015 |
Journal volume | 44 |
Journal issue | 10 |
Pages of publication | 4474 - 4484 |
a | 10.2094 ± 0.0003 Å |
b | 11.0128 ± 0.0004 Å |
c | 12.9469 ± 0.0004 Å |
α | 98.641 ± 0.003° |
β | 92.784 ± 0.002° |
γ | 95.509 ± 0.003° |
Cell volume | 1429.56 ± 0.08 Å3 |
Cell temperature | 160 ± 2 K |
Ambient diffraction temperature | 160 ± 2 K |
Number of distinct elements | 6 |
Space group number | 2 |
Hermann-Mauguin space group symbol | P -1 |
Hall space group symbol | -P 1 |
Residual factor for all reflections | 0.0533 |
Residual factor for significantly intense reflections | 0.0412 |
Weighted residual factors for significantly intense reflections | 0.1156 |
Weighted residual factors for all reflections included in the refinement | 0.1196 |
Goodness-of-fit parameter for all reflections included in the refinement | 1.073 |
Diffraction radiation wavelength | 0.71073 Å |
Diffraction radiation type | MoKα |