Information card for entry 7033732
Formula | C35 H21 N3 O4 Zn |
Calculated formula | C35 H21 N3 O4 Zn |
Title of publication | Highly selective luminescence sensing for Cu(2+) ions and selective CO2 capture in a doubly interpenetrated MOF with Lewis basic pyridyl sites. |
Authors of publication | Liu, Bo; Hou, Lei; Wu, Wei-Ping; Dou, Ai-Na; Wang, Yao-Yu |
Journal of publication | Dalton transactions (Cambridge, England : 2003) |
Year of publication | 2015 |
Journal volume | 44 |
Journal issue | 10 |
Pages of publication | 4423 - 4427 |
a | 18.02 ± 0.005 Å |
b | 27.937 ± 0.007 Å |
c | 23.201 ± 0.006 Å |
α | 90° |
β | 108.317 ± 0.005° |
γ | 90° |
Cell volume | 11088 ± 5 Å3 |
Cell temperature | 296 ± 2 K |
Ambient diffraction temperature | 296 ± 2 K |
Number of distinct elements | 5 |
Space group number | 15 |
Hermann-Mauguin space group symbol | C 1 2/c 1 |
Hall space group symbol | -C 2yc |
Residual factor for all reflections | 0.1086 |
Residual factor for significantly intense reflections | 0.0668 |
Weighted residual factors for significantly intense reflections | 0.1563 |
Weighted residual factors for all reflections included in the refinement | 0.1627 |
Goodness-of-fit parameter for all reflections included in the refinement | 1.185 |
Diffraction radiation wavelength | 0.71073 Å |
Diffraction radiation type | MoKα |