Information card for entry 7033757
Formula | C46 H22 F20 O4 P2 Pd2 |
Calculated formula | C46 H22 F20 O4 P2 Pd2 |
Title of publication | Cyclopalladated complexes containing 2-C6R4PPh2 ligands (R = H, F): one-electron electrochemical reduction leading to metal-carbon σ-bond cleavage via palladium(i). |
Authors of publication | Kar, Gopa; Privér, Steven H; Jones, Lathe A.; Guo, Si-Xuan; Torriero, Angel A. J.; Bond, Alan M.; Bennett, Martin A.; Bhargava, Suresh K. |
Journal of publication | Dalton transactions (Cambridge, England : 2003) |
Year of publication | 2015 |
Journal volume | 44 |
Journal issue | 7 |
Pages of publication | 3367 - 3377 |
a | 10.9599 ± 0.0016 Å |
b | 18.571 ± 0.003 Å |
c | 22.21 ± 0.003 Å |
α | 90° |
β | 90.025 ± 0.003° |
γ | 90° |
Cell volume | 4520.5 ± 1.2 Å3 |
Cell temperature | 150 ± 2 K |
Ambient diffraction temperature | 150 ± 2 K |
Number of distinct elements | 6 |
Space group number | 14 |
Hermann-Mauguin space group symbol | P 1 21/n 1 |
Hall space group symbol | -P 2yn |
Residual factor for all reflections | 0.0845 |
Residual factor for significantly intense reflections | 0.0457 |
Weighted residual factors for significantly intense reflections | 0.0755 |
Weighted residual factors for all reflections included in the refinement | 0.085 |
Goodness-of-fit parameter for all reflections included in the refinement | 0.993 |
Diffraction radiation wavelength | 0.71073 Å |
Diffraction radiation type | MoKα |