Information card for entry 7033760
Formula | C42 H45 In2 N7 Ni O4 S8 Sn2 |
Calculated formula | C36 H24 In2 N6 Ni S8 Sn2 |
Title of publication | Photo-electroactive ternary chalcogenido-indate-stannates with a unique 2-D porous structure. |
Authors of publication | Wu, Jing; Pu, Ya-Yang; Zhao, Xiao-Wei; Qian, Li-Wen; Bian, Guo-Qing; Zhu, Qin-Yu; Dai, Jie |
Journal of publication | Dalton transactions (Cambridge, England : 2003) |
Year of publication | 2015 |
Journal volume | 44 |
Journal issue | 10 |
Pages of publication | 4520 - 4525 |
a | 15.281 ± 0.003 Å |
b | 23.918 ± 0.005 Å |
c | 15.657 ± 0.003 Å |
α | 90° |
β | 107.63 ± 0.03° |
γ | 90° |
Cell volume | 5454 ± 2 Å3 |
Cell temperature | 293 ± 2 K |
Ambient diffraction temperature | 293 ± 2 K |
Number of distinct elements | 8 |
Space group number | 14 |
Hermann-Mauguin space group symbol | P 1 21/n 1 |
Hall space group symbol | -P 2yn |
Residual factor for all reflections | 0.0733 |
Residual factor for significantly intense reflections | 0.0552 |
Weighted residual factors for significantly intense reflections | 0.1502 |
Weighted residual factors for all reflections included in the refinement | 0.1652 |
Goodness-of-fit parameter for all reflections included in the refinement | 0.937 |
Diffraction radiation wavelength | 0.71073 Å |
Diffraction radiation type | MoKα |