Information card for entry 7033786
Formula | C32 H59 Mo6 N3 O19 |
Calculated formula | C32 H59 Mo6 N3 O19 |
Title of publication | N-alkylation of organo-imido substituted polyoxometalates: an efficient and stoichiometric approach for the easy post-modification of polyoxometalates. |
Authors of publication | Khan, Rao Naumaan Nasim; Lv, Chunlin; Zhang, Jin; Hao, Jian; Wei, Yongge |
Journal of publication | Dalton transactions (Cambridge, England : 2003) |
Year of publication | 2015 |
Journal volume | 44 |
Journal issue | 10 |
Pages of publication | 4568 - 4575 |
a | 11.309 ± 0.002 Å |
b | 11.723 ± 0.002 Å |
c | 18.475 ± 0.004 Å |
α | 78.78 ± 0.03° |
β | 88.2 ± 0.03° |
γ | 66.84 ± 0.03° |
Cell volume | 2206.1 ± 0.9 Å3 |
Cell temperature | 153 ± 2 K |
Ambient diffraction temperature | 153 ± 2 K |
Number of distinct elements | 5 |
Space group number | 2 |
Hermann-Mauguin space group symbol | P -1 |
Hall space group symbol | -P 1 |
Residual factor for all reflections | 0.0589 |
Residual factor for significantly intense reflections | 0.0366 |
Weighted residual factors for significantly intense reflections | 0.0731 |
Weighted residual factors for all reflections included in the refinement | 0.0809 |
Goodness-of-fit parameter for all reflections included in the refinement | 1.008 |
Diffraction radiation wavelength | 0.71073 Å |
Diffraction radiation type | MoKα |