Information card for entry 7033788
Formula | C43 H45 Ag4 F9 N12 O9 S4 |
Calculated formula | C43 H45 Ag4 F9 N12 O9 S4 |
Title of publication | Designed synthesis of size-tunable Ag2S nanoclusters via distinguishable C-S bond cleavage reaction of alkyl- and aryl-thiolates. |
Authors of publication | Chen, Hang-Qing; He, Xin; Guo, Hui; Fu, Nan-Yan; Zhao, Liang |
Journal of publication | Dalton transactions (Cambridge, England : 2003) |
Year of publication | 2015 |
Journal volume | 44 |
Journal issue | 9 |
Pages of publication | 3963 - 3966 |
a | 9.869 ± 0.002 Å |
b | 14.777 ± 0.003 Å |
c | 19.741 ± 0.004 Å |
α | 109.94 ± 0.03° |
β | 91.21 ± 0.03° |
γ | 99.21 ± 0.03° |
Cell volume | 2662.5 ± 1.1 Å3 |
Cell temperature | 173 ± 2 K |
Ambient diffraction temperature | 173 ± 2 K |
Number of distinct elements | 7 |
Space group number | 2 |
Hermann-Mauguin space group symbol | P -1 |
Hall space group symbol | -P 1 |
Residual factor for all reflections | 0.0527 |
Residual factor for significantly intense reflections | 0.0479 |
Weighted residual factors for significantly intense reflections | 0.1295 |
Weighted residual factors for all reflections included in the refinement | 0.1435 |
Goodness-of-fit parameter for all reflections included in the refinement | 1.122 |
Diffraction radiation wavelength | 0.71073 Å |
Diffraction radiation type | MoKα |