Information card for entry 7033821
Formula | C24 H33 Cr Cu N8 O11.5 Tb |
Calculated formula | C24 H33 Cr Cu N8 O11.5 Tb |
SMILES | [Tb]123([O]4[Cu]56[O]2c2c([O]1C)cccc2C=[N]6CC[N]5=Cc1cccc(c14)[O]3C)([OH2])([OH2])([OH2])[OH2].N#C[Cr](C#N)(C#N)(C#N)(C#N)C#N.O.O.O.O |
Title of publication | A new family of hetero-tri-metallic complexes [M(CuTb)]n (n = 1, 2, ∞; M = Co, Cr, Fe): synthesis, structure and tailored single-molecule magnet behavior. |
Authors of publication | Bridonneau, N.; Gontard, G.; Marvaud, V. |
Journal of publication | Dalton transactions (Cambridge, England : 2003) |
Year of publication | 2015 |
Journal volume | 44 |
Journal issue | 11 |
Pages of publication | 5170 - 5178 |
a | 26.0774 ± 0.0005 Å |
b | 12.0578 ± 0.0002 Å |
c | 22.9454 ± 0.0004 Å |
α | 90° |
β | 108.621 ± 0.002° |
γ | 90° |
Cell volume | 6837.2 ± 0.2 Å3 |
Cell temperature | 200 ± 1 K |
Ambient diffraction temperature | 200 ± 1 K |
Number of distinct elements | 7 |
Space group number | 14 |
Hermann-Mauguin space group symbol | P 1 21/c 1 |
Hall space group symbol | -P 2ybc |
Residual factor for all reflections | 0.0417 |
Residual factor for significantly intense reflections | 0.0277 |
Weighted residual factors for significantly intense reflections | 0.0613 |
Weighted residual factors for all reflections included in the refinement | 0.0679 |
Goodness-of-fit parameter for all reflections included in the refinement | 1.027 |
Diffraction radiation wavelength | 0.71073 Å |
Diffraction radiation type | MoKα |