Information card for entry 7033826
Formula | C158 H446 Co4 Fe N39 O324 P8 W68 |
Calculated formula | C88 Co4 Fe N25 O282.6 P8 W68 |
Title of publication | Assembly of cyanometalate-functionalized phosphotungstates with magnetic properties and bifunctional electrocatalytic activities. |
Authors of publication | Wang, Ya; Sun, Ming-Hui; Li, Feng-Yan; Sun, Zhi-Xia; Xu, Lin |
Journal of publication | Dalton transactions (Cambridge, England : 2003) |
Year of publication | 2015 |
Journal volume | 44 |
Journal issue | 10 |
Pages of publication | 4504 - 4511 |
a | 20.1703 ± 0.0018 Å |
b | 23.707 ± 0.002 Å |
c | 26.305 ± 0.003 Å |
α | 102.56 ± 0.002° |
β | 91.503 ± 0.002° |
γ | 108.559 ± 0.002° |
Cell volume | 11576.9 ± 1.9 Å3 |
Cell temperature | 273 ± 2 K |
Ambient diffraction temperature | 273 ± 2 K |
Number of distinct elements | 8 |
Space group number | 2 |
Hermann-Mauguin space group symbol | P -1 |
Hall space group symbol | -P 1 |
Residual factor for all reflections | 0.1466 |
Residual factor for significantly intense reflections | 0.0829 |
Weighted residual factors for significantly intense reflections | 0.1924 |
Weighted residual factors for all reflections included in the refinement | 0.2099 |
Goodness-of-fit parameter for all reflections included in the refinement | 1.004 |
Diffraction radiation wavelength | 0.71073 Å |
Diffraction radiation type | MoKα |