Information card for entry 7033837
Formula | C33 H48 Cl4 Co2 N8 Si2 |
Calculated formula | C33 H48 Cl4 Co2 N8 Si2 |
SMILES | [Co]12(N([Si](C)(C)C)C(=[N]3[Co]([n]4c5c3cccc5ccc4C)(N([Si](C)(C)C)C(=[N]2c2c3[n]1c(ccc3ccc2)C)N(C)C)Cl)N(C)C)Cl.ClCCl |
Title of publication | Inserted products of lithium silylquinolylamide dimers [{8-(2-R-C9H5N)N(Me3Si)}Li·OEt2]2 (R = H or Me) with dimethylcyanamide and their reactive derivatives with metal halides. |
Authors of publication | Wang, Peng; Li, Haifen; Xue, Xiaoyan; Chen, Xia |
Journal of publication | Dalton transactions (Cambridge, England : 2003) |
Year of publication | 2015 |
Journal volume | 44 |
Journal issue | 10 |
Pages of publication | 4718 - 4725 |
a | 15.054 ± 0.003 Å |
b | 15.565 ± 0.003 Å |
c | 17.937 ± 0.004 Å |
α | 90° |
β | 107.1 ± 0.03° |
γ | 90° |
Cell volume | 4017.1 ± 1.6 Å3 |
Cell temperature | 173 ± 2 K |
Ambient diffraction temperature | 173 ± 2 K |
Number of distinct elements | 6 |
Space group number | 14 |
Hermann-Mauguin space group symbol | P 1 21/c 1 |
Hall space group symbol | -P 2ybc |
Residual factor for all reflections | 0.0752 |
Residual factor for significantly intense reflections | 0.0633 |
Weighted residual factors for significantly intense reflections | 0.1408 |
Weighted residual factors for all reflections included in the refinement | 0.1496 |
Goodness-of-fit parameter for all reflections included in the refinement | 1.097 |
Diffraction radiation wavelength | 0.71073 Å |
Diffraction radiation type | MoKα |