Information card for entry 7033855
Formula | C45 H30 Co F6 N3 O5 |
Calculated formula | C45 H30 Co F6 N3 O5 |
Title of publication | Assembly of various degrees of interpenetration of Co-MOFs based on mononuclear or dinuclear cluster units: magnetic properties and gas adsorption. |
Authors of publication | Zheng, Meng-Xi; Gao, Xiang-Jing; Zhang, Chuan-Lei; Qin, Ling; Zheng, He-Gen |
Journal of publication | Dalton transactions (Cambridge, England : 2003) |
Year of publication | 2015 |
Journal volume | 44 |
Journal issue | 10 |
Pages of publication | 4751 - 4758 |
a | 22.8097 ± 0.0018 Å |
b | 36.695 ± 0.0015 Å |
c | 14.4183 ± 0.0011 Å |
α | 90° |
β | 106.313 ± 0.002° |
γ | 90° |
Cell volume | 11582.3 ± 1.4 Å3 |
Cell temperature | 291 ± 2 K |
Ambient diffraction temperature | 291 ± 2 K |
Number of distinct elements | 6 |
Space group number | 12 |
Hermann-Mauguin space group symbol | C 1 2/m 1 |
Hall space group symbol | -C 2y |
Residual factor for all reflections | 0.0567 |
Residual factor for significantly intense reflections | 0.0392 |
Weighted residual factors for significantly intense reflections | 0.1383 |
Weighted residual factors for all reflections included in the refinement | 0.1393 |
Goodness-of-fit parameter for all reflections included in the refinement | 1.003 |
Diffraction radiation wavelength | 0.71073 Å |
Diffraction radiation type | MoKα |