Information card for entry 7033860
Formula | C90 H108 B2 Cu2 N16 O2 Si |
Calculated formula | C90 H108 B2 Cu2 N16 O2 Si |
Title of publication | Tp*Cu(i)-CN-SiL2-NC-Cu(i)Tp* - a hexacoordinate Si-complex as connector for redox active metals via π-conjugated ligands. |
Authors of publication | Kämpfe, Alexander; Brendler, Erica; Kroke, Edwin; Wagler, Jörg |
Journal of publication | Dalton transactions (Cambridge, England : 2003) |
Year of publication | 2015 |
Journal volume | 44 |
Journal issue | 10 |
Pages of publication | 4744 - 4750 |
a | 11.3293 ± 0.0007 Å |
b | 13.7572 ± 0.0008 Å |
c | 15.501 ± 0.001 Å |
α | 80.946 ± 0.005° |
β | 74.97 ± 0.005° |
γ | 73.416 ± 0.005° |
Cell volume | 2227.2 ± 0.2 Å3 |
Cell temperature | 200 ± 2 K |
Ambient diffraction temperature | 200 ± 2 K |
Number of distinct elements | 7 |
Space group number | 2 |
Hermann-Mauguin space group symbol | P -1 |
Hall space group symbol | -P 1 |
Residual factor for all reflections | 0.0696 |
Residual factor for significantly intense reflections | 0.0435 |
Weighted residual factors for significantly intense reflections | 0.0987 |
Weighted residual factors for all reflections included in the refinement | 0.1083 |
Goodness-of-fit parameter for all reflections included in the refinement | 1.034 |
Diffraction radiation wavelength | 0.71073 Å |
Diffraction radiation type | MoKα |