Information card for entry 7033862
Formula | C26 H82 B22 Ge2 N2 |
Calculated formula | C26 H82 B22 Ge2 N2 |
Title of publication | Self-assembly of linear [Mn(II)2Mn(III)] units with end-on azido bridges: the construction of a ferromagnetic chain using ST = 7 high-spin trimers. |
Authors of publication | Jiang, Yuan; Qin, Lei; Li, Guanghua; Abbas, Ghulam; Cao, Yaqun; Wu, Gang; Han, Tian; Zheng, Yan-Zhen; Qiu, Shilun |
Journal of publication | Dalton transactions (Cambridge, England : 2003) |
Year of publication | 2015 |
Journal volume | 44 |
Journal issue | 11 |
Pages of publication | 5205 - 5210 |
a | 12.3369 ± 0.0005 Å |
b | 16.3463 ± 0.0008 Å |
c | 19.6863 ± 0.0009 Å |
α | 112.034 ± 0.001° |
β | 99.022 ± 0.001° |
γ | 96.148 ± 0.002° |
Cell volume | 3574.3 ± 0.3 Å3 |
Cell temperature | 173 ± 2 K |
Ambient diffraction temperature | 173 ± 2 K |
Number of distinct elements | 5 |
Space group number | 2 |
Hermann-Mauguin space group symbol | P -1 |
Hall space group symbol | -P 1 |
Residual factor for all reflections | 0.0544 |
Residual factor for significantly intense reflections | 0.0356 |
Weighted residual factors for significantly intense reflections | 0.0813 |
Weighted residual factors for all reflections included in the refinement | 0.0879 |
Goodness-of-fit parameter for all reflections included in the refinement | 1.034 |
Diffraction radiation wavelength | 0.71073 Å |
Diffraction radiation type | MoKα |