Information card for entry 7033866
Formula | C59 H199 Mo36 N13 O169 Sm2 |
Calculated formula | C54 H96 Mo36 N12 O154 Sm2 |
Title of publication | Organic-inorganic hybrid rare earth complexes based on polymolybdates with intrinsic photosensitive properties. |
Authors of publication | Wang, Yuan; Ma, Pengtao; Niu, Jingyang |
Journal of publication | Dalton transactions (Cambridge, England : 2003) |
Year of publication | 2015 |
Journal volume | 44 |
Journal issue | 10 |
Pages of publication | 4679 - 4682 |
a | 18.1715 ± 0.0009 Å |
b | 18.9571 ± 0.001 Å |
c | 31.3002 ± 0.0017 Å |
α | 90° |
β | 103.321 ± 0.001° |
γ | 90° |
Cell volume | 10492.2 ± 1 Å3 |
Cell temperature | 296 ± 2 K |
Ambient diffraction temperature | 296 ± 2 K |
Number of distinct elements | 6 |
Space group number | 14 |
Hermann-Mauguin space group symbol | P 1 21/n 1 |
Hall space group symbol | -P 2yn |
Residual factor for all reflections | 0.0564 |
Residual factor for significantly intense reflections | 0.0469 |
Weighted residual factors for significantly intense reflections | 0.1176 |
Weighted residual factors for all reflections included in the refinement | 0.1226 |
Goodness-of-fit parameter for all reflections included in the refinement | 1.041 |
Diffraction radiation wavelength | 0.71073 Å |
Diffraction radiation type | MoKα |