Information card for entry 7033869
Formula | C59 H201 Dy2 Mo36 N13 O170 |
Calculated formula | C54 H96 Dy2 Mo36 N12 O154 |
Title of publication | Organic-inorganic hybrid rare earth complexes based on polymolybdates with intrinsic photosensitive properties. |
Authors of publication | Wang, Yuan; Ma, Pengtao; Niu, Jingyang |
Journal of publication | Dalton transactions (Cambridge, England : 2003) |
Year of publication | 2015 |
Journal volume | 44 |
Journal issue | 10 |
Pages of publication | 4679 - 4682 |
a | 18.1552 ± 0.0007 Å |
b | 18.964 ± 0.0007 Å |
c | 31.1861 ± 0.0012 Å |
α | 90° |
β | 103.473 ± 0.001° |
γ | 90° |
Cell volume | 10441.7 ± 0.7 Å3 |
Cell temperature | 296 ± 2 K |
Ambient diffraction temperature | 296 ± 2 K |
Number of distinct elements | 6 |
Space group number | 14 |
Hermann-Mauguin space group symbol | P 1 21/n 1 |
Hall space group symbol | -P 2yn |
Residual factor for all reflections | 0.0572 |
Residual factor for significantly intense reflections | 0.0462 |
Weighted residual factors for significantly intense reflections | 0.1215 |
Weighted residual factors for all reflections included in the refinement | 0.1275 |
Goodness-of-fit parameter for all reflections included in the refinement | 1.055 |
Diffraction radiation wavelength | 0.71073 Å |
Diffraction radiation type | MoKα |