Information card for entry 7033876
Formula | C23 H29 Dy N8 O17 |
Calculated formula | C23 H29 Dy N8 O17 |
SMILES | [Dy]1234([OH2])([O]=C(N[N]3=C(c3[n]1c(C(=[N]2NC(c1c(O)cccc1)=[O]4)C)ccc3)C)c1ccccc1O)([OH2])([OH2])ON(=O)=O.O=N(=O)[O-].O=N(=O)[O-].O |
Title of publication | Influence of the coordination environment on slow magnetic relaxation and photoluminescence behavior in two mononuclear dysprosium(iii) based single molecule magnets. |
Authors of publication | Mondal, Amit Kumar; Goswami, Soumyabrata; Konar, Sanjit |
Journal of publication | Dalton transactions (Cambridge, England : 2003) |
Year of publication | 2015 |
Journal volume | 44 |
Journal issue | 11 |
Pages of publication | 5086 - 5094 |
a | 10.1352 ± 0.0007 Å |
b | 15.3564 ± 0.0013 Å |
c | 10.6736 ± 0.0008 Å |
α | 90° |
β | 109.06 ± 0.003° |
γ | 90° |
Cell volume | 1570.2 ± 0.2 Å3 |
Cell temperature | 296 ± 2 K |
Ambient diffraction temperature | 296 ± 2 K |
Number of distinct elements | 5 |
Space group number | 4 |
Hermann-Mauguin space group symbol | P 1 21 1 |
Hall space group symbol | P 2yb |
Residual factor for all reflections | 0.0236 |
Residual factor for significantly intense reflections | 0.0213 |
Weighted residual factors for significantly intense reflections | 0.0406 |
Weighted residual factors for all reflections included in the refinement | 0.0411 |
Goodness-of-fit parameter for all reflections included in the refinement | 1.326 |
Diffraction radiation wavelength | 0.71073 Å |
Diffraction radiation type | MoKα |