Information card for entry 7033883
Formula | C44 H34 Cd2 N6 O6 |
Calculated formula | C44 H34 Cd2 N6 O6 |
SMILES | c12ccccc1[n]1c(c3c([N]4=Cc5c([O]6[Cd]714([O]=C(O7)C)[O]1c4c(C=[N]7c8c(c9[nH]c%10ccccc%10[n]9[Cd]9617[O]=C(O9)C)cccc8)cccc4)cccc5)cccc3)[nH]2 |
Title of publication | Metal ion-assisted ring-opening of a quinazoline-based chemosensor: detection of copper(ii) in aqueous media. |
Authors of publication | Cao, Wei; Zheng, Xiang-Jun; Fang, De-Cai; Jin, Lin-Pei |
Journal of publication | Dalton transactions (Cambridge, England : 2003) |
Year of publication | 2015 |
Journal volume | 44 |
Journal issue | 11 |
Pages of publication | 5191 - 5196 |
a | 10.445 ± 0.0007 Å |
b | 21.7593 ± 0.0014 Å |
c | 8.6952 ± 0.0006 Å |
α | 90° |
β | 101.739 ± 0.001° |
γ | 90° |
Cell volume | 1934.9 ± 0.2 Å3 |
Cell temperature | 296 ± 2 K |
Ambient diffraction temperature | 296 ± 2 K |
Number of distinct elements | 5 |
Space group number | 14 |
Hermann-Mauguin space group symbol | P 1 21/c 1 |
Hall space group symbol | -P 2ybc |
Residual factor for all reflections | 0.0433 |
Residual factor for significantly intense reflections | 0.0304 |
Weighted residual factors for significantly intense reflections | 0.0721 |
Weighted residual factors for all reflections included in the refinement | 0.0778 |
Goodness-of-fit parameter for all reflections included in the refinement | 1.036 |
Diffraction radiation wavelength | 0.71073 Å |
Diffraction radiation type | MoKα |