Information card for entry 7033888
Formula | C41 H60 Cl5 Co F6 N O13 P5 Re Rh |
Calculated formula | C41 H60 Cl5 Co F6 N O13 P5 Re Rh |
Title of publication | Heterobimetallic rhenium nitrido complexes containing the Kläui tripodal ligand [Co(η(5)-C5H5){P(O)(OEt)2}3](.). |
Authors of publication | So, Yat-Ming; Chiu, Wai-Hang; Cheung, Wai-Man; Ng, Ho-Yuen; Lee, Hung Kay; Sung, Herman H.-Y.; Williams, Ian D.; Leung, Wa-Hung |
Journal of publication | Dalton transactions (Cambridge, England : 2003) |
Year of publication | 2015 |
Journal volume | 44 |
Journal issue | 12 |
Pages of publication | 5479 - 5487 |
a | 12.1611 ± 0.0002 Å |
b | 14.3726 ± 0.0003 Å |
c | 32.8546 ± 0.0006 Å |
α | 90° |
β | 97.1682 ± 0.0018° |
γ | 90° |
Cell volume | 5697.66 ± 0.19 Å3 |
Cell temperature | 100 ± 0.2 K |
Ambient diffraction temperature | 100 ± 0.2 K |
Number of distinct elements | 10 |
Space group number | 14 |
Hermann-Mauguin space group symbol | P 1 21/n 1 |
Hall space group symbol | -P 2yn |
Residual factor for all reflections | 0.0726 |
Residual factor for significantly intense reflections | 0.0505 |
Weighted residual factors for significantly intense reflections | 0.1116 |
Weighted residual factors for all reflections included in the refinement | 0.1214 |
Goodness-of-fit parameter for all reflections included in the refinement | 1.002 |
Diffraction radiation probe | x-ray |
Diffraction radiation wavelength | 1.5418 Å |
Diffraction radiation type | CuKα |