Information card for entry 7033897
Formula | C25 H37 Co N2 O7 P |
Calculated formula | C25 H37 Co N2 O7 P |
Title of publication | Discrete and polymeric cobalt organophosphates: isolation of a 3-D cobalt phosphate framework exhibiting selective CO2 capture. |
Authors of publication | Gupta, Sandeep K.; Kuppuswamy, Subramaniam; Walsh, James P. S.; McInnes, Eric J. L.; Murugavel, Ramaswamy |
Journal of publication | Dalton transactions (Cambridge, England : 2003) |
Year of publication | 2015 |
Journal volume | 44 |
Journal issue | 12 |
Pages of publication | 5587 - 5601 |
a | 12.313 ± 0.003 Å |
b | 12.624 ± 0.003 Å |
c | 18.217 ± 0.005 Å |
α | 90° |
β | 92.911 ± 0.004° |
γ | 90° |
Cell volume | 2828 ± 1.2 Å3 |
Cell temperature | 150 ± 2 K |
Ambient diffraction temperature | 150 ± 2 K |
Number of distinct elements | 6 |
Space group number | 14 |
Hermann-Mauguin space group symbol | P 1 21/n 1 |
Hall space group symbol | -P 2yn |
Residual factor for all reflections | 0.0304 |
Residual factor for significantly intense reflections | 0.03 |
Weighted residual factors for significantly intense reflections | 0.0775 |
Weighted residual factors for all reflections included in the refinement | 0.078 |
Goodness-of-fit parameter for all reflections included in the refinement | 1.093 |
Diffraction radiation wavelength | 0.71075 Å |
Diffraction radiation type | MoKα |