Information card for entry 7033899
Formula | C46 H74 Co2 N8 O10 P2 |
Calculated formula | C46 H74 Co2 N8 O10 P2 |
Title of publication | Discrete and polymeric cobalt organophosphates: isolation of a 3-D cobalt phosphate framework exhibiting selective CO2 capture. |
Authors of publication | Gupta, Sandeep K.; Kuppuswamy, Subramaniam; Walsh, James P. S.; McInnes, Eric J. L.; Murugavel, Ramaswamy |
Journal of publication | Dalton transactions (Cambridge, England : 2003) |
Year of publication | 2015 |
Journal volume | 44 |
Journal issue | 12 |
Pages of publication | 5587 - 5601 |
a | 9.2911 ± 0.0016 Å |
b | 11.821 ± 0.003 Å |
c | 12.926 ± 0.003 Å |
α | 88.042 ± 0.007° |
β | 78.263 ± 0.007° |
γ | 82.427 ± 0.008° |
Cell volume | 1377.8 ± 0.5 Å3 |
Cell temperature | 150 ± 2 K |
Ambient diffraction temperature | 150 ± 2 K |
Number of distinct elements | 6 |
Space group number | 2 |
Hermann-Mauguin space group symbol | P -1 |
Hall space group symbol | -P 1 |
Residual factor for all reflections | 0.0324 |
Residual factor for significantly intense reflections | 0.0305 |
Weighted residual factors for significantly intense reflections | 0.0805 |
Weighted residual factors for all reflections included in the refinement | 0.082 |
Goodness-of-fit parameter for all reflections included in the refinement | 1.059 |
Diffraction radiation wavelength | 0.71075 Å |
Diffraction radiation type | MoKα |