Information card for entry 7033914
Formula | C31 H63 Cl2 Cu7 N6 Se12 |
Calculated formula | C31 H63 Cl2 Cu6.9998 N6 Se12 |
Title of publication | Copper(i) diselenocarbamate clusters: synthesis, structures and single-source precursors for Cu and Se composite materials. |
Authors of publication | Dhayal, Rajendra S.; Liao, Jian-Hong; Hou, Hsing-Nan; Ervilita, Ria; Liao, Ping-Kuei; Liu, C. W. |
Journal of publication | Dalton transactions (Cambridge, England : 2003) |
Year of publication | 2015 |
Journal volume | 44 |
Journal issue | 12 |
Pages of publication | 5898 - 5908 |
a | 19.1629 ± 0.0006 Å |
b | 11.8176 ± 0.0004 Å |
c | 24.1013 ± 0.0007 Å |
α | 90° |
β | 91.207 ± 0.0008° |
γ | 90° |
Cell volume | 5456.8 ± 0.3 Å3 |
Cell temperature | 150 ± 2 K |
Ambient diffraction temperature | 150 ± 2 K |
Number of distinct elements | 6 |
Space group number | 15 |
Hermann-Mauguin space group symbol | C 1 2/c 1 |
Hall space group symbol | -C 2yc |
Residual factor for all reflections | 0.0421 |
Residual factor for significantly intense reflections | 0.0325 |
Weighted residual factors for significantly intense reflections | 0.0709 |
Weighted residual factors for all reflections included in the refinement | 0.0743 |
Goodness-of-fit parameter for all reflections included in the refinement | 1.036 |
Diffraction radiation wavelength | 0.71073 Å |
Diffraction radiation type | MoKα |