Information card for entry 7033916
Chemical name | 3.PF6 |
Formula | C36 H30 F6 Ir N5 O P |
Calculated formula | C36 H30 F6 Ir N5 O P |
Title of publication | Iridium(iii) N-heterocyclic carbene complexes: an experimental and theoretical study of structural, spectroscopic, electrochemical and electrogenerated chemiluminescence properties. |
Authors of publication | Barbante, Gregory J.; Doeven, Egan H.; Francis, Paul S.; Stringer, Bradley D.; Hogan, Conor F.; Kheradmand, Peyman R.; Wilson, David J. D.; Barnard, Peter J. |
Journal of publication | Dalton transactions (Cambridge, England : 2003) |
Year of publication | 2015 |
Journal volume | 44 |
Journal issue | 18 |
Pages of publication | 8564 - 8576 |
a | 13.818 ± 0.003 Å |
b | 13.881 ± 0.003 Å |
c | 17.586 ± 0.004 Å |
α | 90° |
β | 101.65 ± 0.03° |
γ | 90° |
Cell volume | 3303.6 ± 1.3 Å3 |
Cell temperature | 173.2 K |
Ambient diffraction temperature | 173.2 K |
Number of distinct elements | 7 |
Space group number | 14 |
Hermann-Mauguin space group symbol | P 1 21/n 1 |
Hall space group symbol | -P 2yn |
Residual factor for all reflections | 0.0378 |
Residual factor for significantly intense reflections | 0.0319 |
Weighted residual factors for significantly intense reflections | 0.0703 |
Weighted residual factors for all reflections included in the refinement | 0.0728 |
Goodness-of-fit parameter for all reflections included in the refinement | 1.095 |
Diffraction radiation wavelength | 0.71073 Å |
Diffraction radiation type | MoKα |