Information card for entry 7033920
Formula | C61.5 H86 Ga2 N4 Te2 |
Calculated formula | C61.5 H86 Ga2 N4 Te2 |
Title of publication | Te-Te and Te-C bond cleavage reactions using a monovalent gallanediyl. |
Authors of publication | Ganesamoorthy, Chelladurai; Bendt, Georg; Bläser, Dieter; Wölper, Christoph; Schulz, Stephan |
Journal of publication | Dalton transactions (Cambridge, England : 2003) |
Year of publication | 2015 |
Journal volume | 44 |
Journal issue | 11 |
Pages of publication | 5153 - 5159 |
a | 18.6322 ± 0.0004 Å |
b | 20.9742 ± 0.0005 Å |
c | 16.4363 ± 0.0004 Å |
α | 90° |
β | 98.982 ± 0.001° |
γ | 90° |
Cell volume | 6344.5 ± 0.3 Å3 |
Cell temperature | 100 ± 1 K |
Ambient diffraction temperature | 100 ± 1 K |
Number of distinct elements | 5 |
Space group number | 12 |
Hermann-Mauguin space group symbol | C 1 2/m 1 |
Hall space group symbol | -C 2y |
Residual factor for all reflections | 0.0293 |
Residual factor for significantly intense reflections | 0.0223 |
Weighted residual factors for significantly intense reflections | 0.0576 |
Weighted residual factors for all reflections included in the refinement | 0.0606 |
Goodness-of-fit parameter for all reflections included in the refinement | 1.072 |
Diffraction radiation wavelength | 0.71073 Å |
Diffraction radiation type | MoKα |