Information card for entry 7033925
Formula | C30 H24 F18 Gd N2 O10 |
Calculated formula | C30 H24 F18 Gd N2 O10 |
Title of publication | Slow magnetic relaxation and field-induced metamagnetism in nitronyl nitroxide-Dy(iii) magnetic chains. |
Authors of publication | Wang, Xiufeng; Li, Yungai; Hu, Peng; Wang, Juanjuan; Li, Licun |
Journal of publication | Dalton transactions (Cambridge, England : 2003) |
Year of publication | 2015 |
Journal volume | 44 |
Journal issue | 10 |
Pages of publication | 4560 - 4567 |
a | 22.261 ± 0.004 Å |
b | 16.582 ± 0.003 Å |
c | 23.453 ± 0.005 Å |
α | 90° |
β | 117.45 ± 0.03° |
γ | 90° |
Cell volume | 7683 ± 3 Å3 |
Cell temperature | 113 ± 2 K |
Ambient diffraction temperature | 113 ± 2 K |
Number of distinct elements | 6 |
Space group number | 14 |
Hermann-Mauguin space group symbol | P 1 21/c 1 |
Hall space group symbol | -P 2ybc |
Residual factor for all reflections | 0.0603 |
Residual factor for significantly intense reflections | 0.0444 |
Weighted residual factors for significantly intense reflections | 0.0969 |
Weighted residual factors for all reflections included in the refinement | 0.1049 |
Goodness-of-fit parameter for all reflections included in the refinement | 1.026 |
Diffraction radiation wavelength | 0.71073 Å |
Diffraction radiation type | MoKα |