Information card for entry 7033940
Formula | C14 H35 B19 Ru |
Calculated formula | C14 H35 B19 Ru |
Title of publication | Icosahedral metallacarborane/carborane species derived from 1,1'-bis(o-carborane). |
Authors of publication | Thiripuranathar, Gobika; Man, Wing Y.; Palmero, Cesar; Chan, Antony P. Y.; Leube, Bernhard T.; Ellis, David; McKay, David; Macgregor, Stuart A.; Jourdan, Laure; Rosair, Georgina M.; Welch, Alan J. |
Journal of publication | Dalton transactions (Cambridge, England : 2003) |
Year of publication | 2015 |
Journal volume | 44 |
Journal issue | 12 |
Pages of publication | 5628 - 5637 |
a | 10.9051 ± 0.0009 Å |
b | 16.9528 ± 0.0014 Å |
c | 13.8437 ± 0.0011 Å |
α | 90° |
β | 105.039 ± 0.004° |
γ | 90° |
Cell volume | 2471.7 ± 0.4 Å3 |
Cell temperature | 100 ± 0.2 K |
Ambient diffraction temperature | 100 ± 0.2 K |
Number of distinct elements | 4 |
Space group number | 14 |
Hermann-Mauguin space group symbol | P 1 21/n 1 |
Hall space group symbol | -P 2yn |
Residual factor for all reflections | 0.0392 |
Residual factor for significantly intense reflections | 0.0288 |
Weighted residual factors for significantly intense reflections | 0.0639 |
Weighted residual factors for all reflections included in the refinement | 0.068 |
Goodness-of-fit parameter for all reflections included in the refinement | 1.031 |
Diffraction radiation wavelength | 0.71073 Å |
Diffraction radiation type | MoKα |