Information card for entry 7033950
Formula | C11 H6 Au Cl2 F2 N |
Calculated formula | C11 H6 Au Cl2 F2 N |
SMILES | [Au]1(c2cc(F)cc(F)c2c2[n]1cccc2)(Cl)Cl |
Title of publication | Cyclometallated gold(iii) aryl-pyridine complexes as efficient catalysts for three-component synthesis of substituted oxazoles. |
Authors of publication | von Wachenfeldt, Henrik; Polukeev, Alexey V.; Loganathan, Nagarajan; Paulsen, Filip; Röse, Philipp; Garreau, Marion; Wendt, Ola F.; Strand, Daniel |
Journal of publication | Dalton transactions (Cambridge, England : 2003) |
Year of publication | 2015 |
Journal volume | 44 |
Journal issue | 12 |
Pages of publication | 5347 - 5353 |
a | 8.058 ± 0.006 Å |
b | 16.703 ± 0.002 Å |
c | 9.025 ± 0.005 Å |
α | 90° |
β | 106.149 ± 0.003° |
γ | 90° |
Cell volume | 1166.8 ± 1.1 Å3 |
Cell temperature | 293 ± 2 K |
Ambient diffraction temperature | 293 ± 2 K |
Number of distinct elements | 6 |
Space group number | 14 |
Hermann-Mauguin space group symbol | P 1 21/c 1 |
Hall space group symbol | -P 2ybc |
Residual factor for all reflections | 0.0779 |
Residual factor for significantly intense reflections | 0.0527 |
Weighted residual factors for significantly intense reflections | 0.1194 |
Weighted residual factors for all reflections included in the refinement | 0.1277 |
Goodness-of-fit parameter for all reflections included in the refinement | 1.023 |
Diffraction radiation wavelength | 0.71069 Å |
Diffraction radiation type | MoKα |