Information card for entry 7033960
Formula | C31 H29 Dy2 O18 |
Calculated formula | C31 H28 Dy2 O18 |
Title of publication | Luminescent lanthanide MOFs based on conjugated 1,1'-ethynebenzene-3,3',5,5'-tetracarboxylate ligand: syntheses, structures and photoluminescent properties. |
Authors of publication | Zhai, Lu; Zhang, Wen-Wei; Ren, Xiao-Ming; Zuo, Jing-Lin |
Journal of publication | Dalton transactions (Cambridge, England : 2003) |
Year of publication | 2015 |
Journal volume | 44 |
Journal issue | 12 |
Pages of publication | 5746 - 5754 |
a | 14.4821 ± 0.0018 Å |
b | 16.7137 ± 0.0019 Å |
c | 19.213 ± 0.0012 Å |
α | 90° |
β | 108.039 ± 0.003° |
γ | 90° |
Cell volume | 4421.9 ± 0.8 Å3 |
Cell temperature | 291 ± 2 K |
Ambient diffraction temperature | 291 ± 2 K |
Number of distinct elements | 4 |
Space group number | 14 |
Hermann-Mauguin space group symbol | P 1 21/n 1 |
Hall space group symbol | -P 2yn |
Residual factor for all reflections | 0.053 |
Residual factor for significantly intense reflections | 0.0419 |
Weighted residual factors for significantly intense reflections | 0.0906 |
Weighted residual factors for all reflections included in the refinement | 0.0926 |
Goodness-of-fit parameter for all reflections included in the refinement | 0.987 |
Diffraction radiation wavelength | 0.71073 Å |
Diffraction radiation type | MoKα |