Information card for entry 7033962
Common name | sodium dimanganese pentaborohydride bis(diethyl ether) |
Formula | C8 H40 B5 Mn2 Na O2 |
Calculated formula | C8 H40 B5 Mn2 Na O2 |
Title of publication | Challenges in the synthetic routes to Mn(BH4)2: insight into intermediate compounds. |
Authors of publication | Tumanov, Nikolay A.; Safin, Damir A.; Richter, Bo; Łodziana, Zbigniew; Jensen, Torben R.; Garcia, Yann; Filinchuk, Yaroslav |
Journal of publication | Dalton transactions (Cambridge, England : 2003) |
Year of publication | 2015 |
Journal volume | 44 |
Journal issue | 14 |
Pages of publication | 6571 - 6580 |
a | 14.5133 ± 0.0006 Å |
b | 7.4487 ± 0.0003 Å |
c | 10.7119 ± 0.0005 Å |
α | 90° |
β | 104.338 ± 0.005° |
γ | 90° |
Cell volume | 1121.94 ± 0.09 Å3 |
Cell temperature | 150 ± 2 K |
Ambient diffraction temperature | 150 ± 2 K |
Number of distinct elements | 6 |
Space group number | 5 |
Hermann-Mauguin space group symbol | C 1 2 1 |
Hall space group symbol | C 2y |
Residual factor for all reflections | 0.0659 |
Residual factor for significantly intense reflections | 0.0557 |
Weighted residual factors for significantly intense reflections | 0.1459 |
Weighted residual factors for all reflections included in the refinement | 0.1545 |
Goodness-of-fit parameter for all reflections included in the refinement | 1.035 |
Diffraction radiation wavelength | 0.71073 Å |
Diffraction radiation type | MoKα |