Information card for entry 7033982
Formula | C233 H325 Al6 N9 O24 |
Calculated formula | C233 H325 Al6 N9 O24 |
Title of publication | Bulky metallocavitands with a chiral cavity constructed by aluminum and magnesium atrane-likes: enantioselective recognition and separation of racemic alcohols. |
Authors of publication | Li, Yingguo; Yu, Dawei; Dai, Zhongran; Zhang, Jinjin; Shao, Yongliang; Tang, Ning; Wu, Jincai |
Journal of publication | Dalton transactions (Cambridge, England : 2003) |
Year of publication | 2015 |
Journal volume | 44 |
Journal issue | 12 |
Pages of publication | 5692 - 5702 |
a | 18.9563 ± 0.0004 Å |
b | 16.2903 ± 0.0004 Å |
c | 38.5631 ± 0.0009 Å |
α | 90° |
β | 101.677 ± 0.003° |
γ | 90° |
Cell volume | 11662 ± 0.5 Å3 |
Cell temperature | 293 ± 2 K |
Ambient diffraction temperature | 293 ± 2 K |
Number of distinct elements | 5 |
Space group number | 14 |
Hermann-Mauguin space group symbol | P 1 21/c 1 |
Hall space group symbol | -P 2ybc |
Residual factor for all reflections | 0.1032 |
Residual factor for significantly intense reflections | 0.0795 |
Weighted residual factors for significantly intense reflections | 0.1975 |
Weighted residual factors for all reflections included in the refinement | 0.2275 |
Goodness-of-fit parameter for all reflections included in the refinement | 0.984 |
Diffraction radiation wavelength | 0.71073 Å |
Diffraction radiation type | MoKα |