Information card for entry 7033990
Chemical name | 1,3-bis-(2,6-diisopropylphenyl)-1,3,2-diazaphospholenium-tricarbonyl-ferrate(-II) |
Formula | C29 H37 Fe N2 O3 P |
Calculated formula | C29 H37 Fe N2 O3 P |
SMILES | [FeH](C#[O])(C#[O])(C#[O])P1N(C=CN1c1c(cccc1C(C)C)C(C)C)c1c(cccc1C(C)C)C(C)C |
Title of publication | An anionic phosphenium complex as an ambident nucleophile. |
Authors of publication | Stadelmann, B.; Bender, J.; Förster, D; Frey, W.; Nieger, M.; Gudat, D. |
Journal of publication | Dalton transactions (Cambridge, England : 2003) |
Year of publication | 2015 |
Journal volume | 44 |
Journal issue | 13 |
Pages of publication | 6023 - 6031 |
a | 10.9098 ± 0.0008 Å |
b | 15.3843 ± 0.0011 Å |
c | 17.738 ± 0.0011 Å |
α | 90° |
β | 99.998 ± 0.002° |
γ | 90° |
Cell volume | 2931.9 ± 0.4 Å3 |
Cell temperature | 100 ± 2 K |
Ambient diffraction temperature | 100 ± 2 K |
Number of distinct elements | 6 |
Space group number | 14 |
Hermann-Mauguin space group symbol | P 1 21/n 1 |
Hall space group symbol | -P 2yn |
Residual factor for all reflections | 0.1059 |
Residual factor for significantly intense reflections | 0.0468 |
Weighted residual factors for significantly intense reflections | 0.0803 |
Weighted residual factors for all reflections included in the refinement | 0.0965 |
Goodness-of-fit parameter for all reflections included in the refinement | 0.987 |
Diffraction radiation wavelength | 0.71073 Å |
Diffraction radiation type | MoKα |