Information card for entry 7034000
Formula | C36 H44 N8 O11 Zn |
Calculated formula | C36 H44 N8 O11 Zn |
Title of publication | Solvent-controlled three families of Zn(ii) coordination compounds: synthesis, crystal structure, solvent-induced structural transformation, supramolecular isomerism and photoluminescence. |
Authors of publication | Han, Lu-Lu; Hu, Tuo-Ping; Mei, Kai; Guo, Zhi-Min; Yin, Chen; Wang, Ya-Xin; Zheng, Jun; Wang, Xing-Po; Sun, Di |
Journal of publication | Dalton transactions (Cambridge, England : 2003) |
Year of publication | 2015 |
Journal volume | 44 |
Journal issue | 13 |
Pages of publication | 6052 - 6061 |
a | 21.1966 ± 0.0011 Å |
b | 8.3014 ± 0.0004 Å |
c | 23.8707 ± 0.0013 Å |
α | 90° |
β | 104.639 ± 0.001° |
γ | 90° |
Cell volume | 4064 ± 0.4 Å3 |
Cell temperature | 298 ± 2 K |
Ambient diffraction temperature | 298 ± 2 K |
Number of distinct elements | 5 |
Space group number | 15 |
Hermann-Mauguin space group symbol | C 1 2/c 1 |
Hall space group symbol | -C 2yc |
Residual factor for all reflections | 0.0355 |
Residual factor for significantly intense reflections | 0.0328 |
Weighted residual factors for significantly intense reflections | 0.0891 |
Weighted residual factors for all reflections included in the refinement | 0.0913 |
Goodness-of-fit parameter for all reflections included in the refinement | 1.038 |
Diffraction radiation wavelength | 0.71073 Å |
Diffraction radiation type | MoKα |