Information card for entry 7034010
Formula | C17 H16 Hg O2 S2 |
Calculated formula | C17 H16 Hg O2 S2 |
SMILES | [Hg]1(SC(=CC(=[O]1)c1ccc(cc1)OC)SC)c1ccccc1 |
Title of publication | Influence of the ligand frameworks on the coordination environment and properties of new phenylmercury(ii) β-oxodithioester complexes. |
Authors of publication | Rajput, Gunjan; Yadav, Manoj Kumar; Drew, Michael G. B.; Singh, Nanhai |
Journal of publication | Dalton transactions (Cambridge, England : 2003) |
Year of publication | 2015 |
Journal volume | 44 |
Journal issue | 12 |
Pages of publication | 5909 - 5916 |
a | 11.7409 ± 0.0015 Å |
b | 5.3998 ± 0.001 Å |
c | 13.192 ± 0.002 Å |
α | 90° |
β | 93.737 ± 0.014° |
γ | 90° |
Cell volume | 834.6 ± 0.2 Å3 |
Cell temperature | 293 ± 2 K |
Ambient diffraction temperature | 293 ± 2 K |
Number of distinct elements | 5 |
Space group number | 4 |
Hermann-Mauguin space group symbol | P 1 21 1 |
Hall space group symbol | P 2yb |
Residual factor for all reflections | 0.1019 |
Residual factor for significantly intense reflections | 0.0722 |
Weighted residual factors for significantly intense reflections | 0.1598 |
Weighted residual factors for all reflections included in the refinement | 0.1729 |
Goodness-of-fit parameter for all reflections included in the refinement | 0.958 |
Diffraction radiation wavelength | 0.71073 Å |
Diffraction radiation type | MoKα |