Information card for entry 7034016
Formula | C37 H28 Cd N6 O6 |
Calculated formula | C37 H28 Cd N6 O6 |
Title of publication | Chiral crystallization and optical properties of three metal complexes based on two non-centrosymmetric tripodal ligands. |
Authors of publication | Zhang, Ming-Dao; Shi, Zhi-Qiang; Chen, Min-Dong; Zheng, He-Gen |
Journal of publication | Dalton transactions (Cambridge, England : 2003) |
Year of publication | 2015 |
Journal volume | 44 |
Journal issue | 12 |
Pages of publication | 5818 - 5825 |
a | 10.005 ± 0.003 Å |
b | 18.631 ± 0.006 Å |
c | 19.444 ± 0.006 Å |
α | 90° |
β | 90° |
γ | 90° |
Cell volume | 3624.4 ± 1.9 Å3 |
Cell temperature | 293 ± 2 K |
Ambient diffraction temperature | 293 ± 2 K |
Number of distinct elements | 5 |
Space group number | 19 |
Hermann-Mauguin space group symbol | P 21 21 21 |
Hall space group symbol | P 2ac 2ab |
Residual factor for all reflections | 0.0694 |
Residual factor for significantly intense reflections | 0.061 |
Weighted residual factors for significantly intense reflections | 0.1569 |
Weighted residual factors for all reflections included in the refinement | 0.162 |
Goodness-of-fit parameter for all reflections included in the refinement | 1.08 |
Diffraction radiation wavelength | 0.71073 Å |
Diffraction radiation type | MoKα |