Information card for entry 7034019
Formula | C12 H36 Cu2 N8 P2 |
Calculated formula | C12 H36 Cu2 N8 P2 |
Title of publication | Why are the {Cu4N4} rings in copper(i) phosphinimide clusters [Cu{μ-N[double bond, length as m-dash]PR3}]4 (R = NMe3 or Ph) planar? |
Authors of publication | Robinson, Thomas P.; Price, Richard D.; Davidson, Matthew G.; Fox, Mark A.; Johnson, Andrew L. |
Journal of publication | Dalton transactions (Cambridge, England : 2003) |
Year of publication | 2015 |
Journal volume | 44 |
Journal issue | 12 |
Pages of publication | 5611 - 5619 |
a | 13.232 ± 0.0001 Å |
b | 13.994 ± 0.0002 Å |
c | 13.303 ± 0.0002 Å |
α | 90° |
β | 117.24 ± 0.001° |
γ | 90° |
Cell volume | 2190.11 ± 0.05 Å3 |
Cell temperature | 150 ± 2 K |
Ambient diffraction temperature | 150 ± 2 K |
Number of distinct elements | 5 |
Space group number | 14 |
Hermann-Mauguin space group symbol | P 1 21/n 1 |
Hall space group symbol | -P 2yn |
Residual factor for all reflections | 0.0329 |
Residual factor for significantly intense reflections | 0.0289 |
Weighted residual factors for significantly intense reflections | 0.076 |
Weighted residual factors for all reflections included in the refinement | 0.0793 |
Goodness-of-fit parameter for all reflections included in the refinement | 1.064 |
Diffraction radiation wavelength | 0.71073 Å |
Diffraction radiation type | MoKα |