Information card for entry 7034024
Formula | C15 H20 Ag Cl N4 O4 |
Calculated formula | C15 H20 Ag Cl N4 O4 |
Title of publication | Macrocyclic dinuclear, helical, layered and 3-D Ag(i) complexes constructed from AgX (X = NO3(-) and ClO4(-)) and flexible bis(pyridyl) ligands with a chelating spacer: syntheses, structures and photoluminescence properties. |
Authors of publication | Huang, Jing; Deng, Zhao-Peng; Xiao, Ying-Hui; Huo, Li-Hua; Zhao, Shu-Nan; Ge, Fa-Yuan; Gao, Shan |
Journal of publication | Dalton transactions (Cambridge, England : 2003) |
Year of publication | 2015 |
Journal volume | 44 |
Journal issue | 12 |
Pages of publication | 5837 - 5847 |
a | 9.7157 ± 0.0005 Å |
b | 10.1084 ± 0.0004 Å |
c | 19.1032 ± 0.0008 Å |
α | 90° |
β | 94.253 ± 0.004° |
γ | 90° |
Cell volume | 1870.96 ± 0.14 Å3 |
Cell temperature | 295 ± 2 K |
Ambient diffraction temperature | 295 ± 2 K |
Number of distinct elements | 6 |
Space group number | 14 |
Hermann-Mauguin space group symbol | P 1 21/n 1 |
Hall space group symbol | -P 2yn |
Residual factor for all reflections | 0.1145 |
Residual factor for significantly intense reflections | 0.0567 |
Weighted residual factors for significantly intense reflections | 0.1267 |
Weighted residual factors for all reflections included in the refinement | 0.1516 |
Goodness-of-fit parameter for all reflections included in the refinement | 1.009 |
Diffraction radiation wavelength | 0.71073 Å |
Diffraction radiation type | MoKα |