Information card for entry 7034037
Formula | C15 H16 Cu2 I2 N4 O |
Calculated formula | C15 H16 Cu2 I2 N4 O |
Title of publication | Luminescent [Cu4I4] aggregates and [Cu3I3]-cyclic coordination polymers supported by quinolyl-triazoles. |
Authors of publication | Bai, Shi-Qiang; Jiang, Lu; Young, David James; Hor, T. S. Andy |
Journal of publication | Dalton transactions (Cambridge, England : 2003) |
Year of publication | 2015 |
Journal volume | 44 |
Journal issue | 13 |
Pages of publication | 6075 - 6081 |
a | 44.1285 ± 0.0014 Å |
b | 4.2321 ± 0.0001 Å |
c | 19.1234 ± 0.0006 Å |
α | 90° |
β | 99.077 ± 0.001° |
γ | 90° |
Cell volume | 3526.69 ± 0.18 Å3 |
Cell temperature | 110 ± 2 K |
Ambient diffraction temperature | 110 ± 2 K |
Number of distinct elements | 6 |
Space group number | 15 |
Hermann-Mauguin space group symbol | C 1 2/c 1 |
Hall space group symbol | -C 2yc |
Residual factor for all reflections | 0.0262 |
Residual factor for significantly intense reflections | 0.0221 |
Weighted residual factors for significantly intense reflections | 0.0461 |
Weighted residual factors for all reflections included in the refinement | 0.0474 |
Goodness-of-fit parameter for all reflections included in the refinement | 1.07 |
Diffraction radiation wavelength | 0.71073 Å |
Diffraction radiation type | MoKα |