Information card for entry 7034049
Formula | C15 H22.25 N O2 |
Calculated formula | C15.1 H22.2 N O2 |
Title of publication | Synthesis, structural studies and ligand influence on the stability of aryl-NHC stabilised trimethylaluminium complexes. |
Authors of publication | Wu M, Melissa; Gill, Arran M.; Yunpeng, Lu; Falivene, Laura; Yongxin, Li; Ganguly, Rakesh; Cavallo, Luigi; García, Felipe |
Journal of publication | Dalton transactions (Cambridge, England : 2003) |
Year of publication | 2015 |
Journal volume | 44 |
Journal issue | 34 |
Pages of publication | 15166 - 15174 |
a | 10.653 ± 0.002 Å |
b | 17.656 ± 0.003 Å |
c | 15.577 ± 0.003 Å |
α | 90° |
β | 98.9 ± 0.006° |
γ | 90° |
Cell volume | 2894.6 ± 0.9 Å3 |
Cell temperature | 103 ± 2 K |
Ambient diffraction temperature | 103 ± 2 K |
Number of distinct elements | 4 |
Space group number | 14 |
Hermann-Mauguin space group symbol | P 1 21/c 1 |
Hall space group symbol | -P 2ybc |
Residual factor for all reflections | 0.1706 |
Residual factor for significantly intense reflections | 0.0775 |
Weighted residual factors for significantly intense reflections | 0.1758 |
Weighted residual factors for all reflections included in the refinement | 0.2137 |
Goodness-of-fit parameter for all reflections included in the refinement | 1.021 |
Diffraction radiation wavelength | 0.71073 Å |
Diffraction radiation type | MoKα |