Information card for entry 7034065
Formula | C36 H54 B2 Dy N O2 P2 S Si |
Calculated formula | C36 H54 B2 Dy N O2 P2 S Si |
Title of publication | (Iminophosphoranyl)(thiophosphoranyl)methane rare-earth borohydride complexes: synthesis, structures and polymerization catalysis. |
Authors of publication | Schmid, Matthias; Oña-Burgos, Pascual; Guillaume, Sophie M.; Roesky, Peter W. |
Journal of publication | Dalton transactions (Cambridge, England : 2003) |
Year of publication | 2015 |
Journal volume | 44 |
Journal issue | 27 |
Pages of publication | 12338 - 12348 |
a | 9.8348 ± 0.0007 Å |
b | 11.4038 ± 0.0006 Å |
c | 36.103 ± 0.003 Å |
α | 90° |
β | 97.516 ± 0.006° |
γ | 90° |
Cell volume | 4014.3 ± 0.5 Å3 |
Cell temperature | 150 K |
Ambient diffraction temperature | 150 K |
Number of distinct elements | 9 |
Space group number | 14 |
Hermann-Mauguin space group symbol | P 1 21/n 1 |
Hall space group symbol | -P 2yn |
Residual factor for all reflections | 0.1069 |
Residual factor for significantly intense reflections | 0.0638 |
Weighted residual factors for significantly intense reflections | 0.1304 |
Weighted residual factors for all reflections included in the refinement | 0.1448 |
Goodness-of-fit parameter for all reflections included in the refinement | 1.005 |
Diffraction radiation wavelength | 0.71073 Å |
Diffraction radiation type | MoKα |