Information card for entry 7034079
Formula | C19 H47 Li N4 Zn |
Calculated formula | C19 H47 Li N4 Zn |
Title of publication | Heterobimetallic metallation studies of N,N-dimethylphenylethylamine (DMPEA): benzylic C-H bond cleavage/dimethylamino capture or intact DMPEA complex. |
Authors of publication | Kennedy, Alan R.; Mulvey, Robert E.; Ramsay, Donna L.; Robertson, Stuart D. |
Journal of publication | Dalton transactions (Cambridge, England : 2003) |
Year of publication | 2015 |
Journal volume | 44 |
Journal issue | 12 |
Pages of publication | 5875 - 5887 |
a | 29.1528 ± 0.001 Å |
b | 9.1827 ± 0.0003 Å |
c | 18.4451 ± 0.0006 Å |
α | 90° |
β | 90° |
γ | 90° |
Cell volume | 4937.8 ± 0.3 Å3 |
Cell temperature | 123 ± 2 K |
Ambient diffraction temperature | 123 ± 2 K |
Number of distinct elements | 5 |
Space group number | 60 |
Hermann-Mauguin space group symbol | P b c n |
Hall space group symbol | -P 2n 2ab |
Residual factor for all reflections | 0.0867 |
Residual factor for significantly intense reflections | 0.0457 |
Weighted residual factors for significantly intense reflections | 0.0881 |
Weighted residual factors for all reflections included in the refinement | 0.1026 |
Goodness-of-fit parameter for all reflections included in the refinement | 1.021 |
Diffraction radiation wavelength | 0.71073 Å |
Diffraction radiation type | MoKα |