Information card for entry 7034084
Formula | C66 H152 Ag4 N16 O0.5 P8 Se8 |
Calculated formula | C66 H152 Ag4 N16 O0.5 P8 Se8 |
Title of publication | Spirocyclic, macrocyclic and ladder complexes of coinage metals and mercury with dichalcogeno P2N2-supported anions. |
Authors of publication | Nordheider, Andreas; Hüll, Katharina; Athukorala Arachchige, Kasun S.; Slawin, Alexandra M. Z.; Woollins, J. Derek; Thirumoorthi, Ramalingam; Chivers, Tristram |
Journal of publication | Dalton transactions (Cambridge, England : 2003) |
Year of publication | 2015 |
Journal volume | 44 |
Journal issue | 12 |
Pages of publication | 5338 - 5346 |
a | 14.449 ± 0.003 Å |
b | 27.568 ± 0.006 Å |
c | 25.838 ± 0.006 Å |
α | 90° |
β | 94.091 ± 0.005° |
γ | 90° |
Cell volume | 10266 ± 4 Å3 |
Cell temperature | 93 K |
Ambient diffraction temperature | 93 K |
Number of distinct elements | 7 |
Space group number | 14 |
Hermann-Mauguin space group symbol | P 1 21/n 1 |
Hall space group symbol | -P 2yn |
Residual factor for all reflections | 0.1298 |
Residual factor for significantly intense reflections | 0.0742 |
Weighted residual factors for significantly intense reflections | 0.1803 |
Weighted residual factors for all reflections included in the refinement | 0.2151 |
Goodness-of-fit parameter for all reflections included in the refinement | 1.14 |
Diffraction radiation wavelength | 0.71075 Å |
Diffraction radiation type | MoKα |