Information card for entry 7034087
Formula | C18 H13 Dy N4 O9 |
Calculated formula | C18 H13 Dy N4 O9 |
Title of publication | Slow magnetic relaxation in a lanthanide helix chain compound [Dy(HNA)(NA)2(NO3)]n (HNA = nicotinic acid). |
Authors of publication | Liu, Shuang; Li, Lei-Lei; Li, Han; Gao, Hong-Ling; Cui, Jian-Zhong; Cheng, Peng |
Journal of publication | Dalton transactions (Cambridge, England : 2003) |
Year of publication | 2015 |
Journal volume | 44 |
Journal issue | 13 |
Pages of publication | 6169 - 6174 |
a | 11.1993 ± 0.0009 Å |
b | 11.1993 ± 0.0009 Å |
c | 26.5836 ± 0.0018 Å |
α | 90° |
β | 90° |
γ | 120° |
Cell volume | 2887.5 ± 0.4 Å3 |
Cell temperature | 128 ± 2 K |
Ambient diffraction temperature | 128 ± 2 K |
Number of distinct elements | 5 |
Space group number | 170 |
Hermann-Mauguin space group symbol | P 65 |
Hall space group symbol | P 65 |
Residual factor for all reflections | 0.0311 |
Residual factor for significantly intense reflections | 0.0282 |
Weighted residual factors for significantly intense reflections | 0.053 |
Weighted residual factors for all reflections included in the refinement | 0.055 |
Goodness-of-fit parameter for all reflections included in the refinement | 1.028 |
Diffraction radiation wavelength | 0.71073 Å |
Diffraction radiation type | MoKα |