Information card for entry 7034103
Formula | C10 H31 N7 Pr Sb Se4 |
Calculated formula | C10 H31 N7 Pr Sb Se4 |
SMILES | [Pr]123456([Se][Sb]([Se]1)(=[Se])[Se-])([NH2]CC[NH]2CC[NH]3CC[NH]4CC[NH2]5)[NH2]CC[NH2]6 |
Title of publication | A series of lanthanoid selenidoantimonates(v): rare examples of lanthanoid selenidoantimonates based on dinuclear lanthanide complexes. |
Authors of publication | Xiao, Hong-Ping; Zhou, Jian; Zhao, Rong-Qing; Zhang, Wei-Bing; Huang, Yong |
Journal of publication | Dalton transactions (Cambridge, England : 2003) |
Year of publication | 2015 |
Journal volume | 44 |
Journal issue | 13 |
Pages of publication | 6032 - 6039 |
a | 8.5433 ± 0.0004 Å |
b | 9.3151 ± 0.0005 Å |
c | 15.0116 ± 0.0007 Å |
α | 77.375 ± 0.001° |
β | 86.86 ± 0.001° |
γ | 70.188 ± 0.001° |
Cell volume | 1096.52 ± 0.09 Å3 |
Cell temperature | 296 ± 2 K |
Ambient diffraction temperature | 296 ± 2 K |
Number of distinct elements | 6 |
Space group number | 2 |
Hermann-Mauguin space group symbol | P -1 |
Hall space group symbol | -P 1 |
Residual factor for all reflections | 0.0217 |
Residual factor for significantly intense reflections | 0.0199 |
Weighted residual factors for significantly intense reflections | 0.0465 |
Weighted residual factors for all reflections included in the refinement | 0.0472 |
Goodness-of-fit parameter for all reflections included in the refinement | 1.083 |
Diffraction radiation wavelength | 0.71073 Å |
Diffraction radiation type | MoKα |