Information card for entry 7034123
Formula | C58 H50 I12 N10 O12 Pb4 |
Calculated formula | C58 H50 I12 N10 O12 Pb4 |
Title of publication | A panchromatic hybrid crystal of iodoplumbate nanowires and J-aggregated naphthalene diimides with long-lived charge-separated states. |
Authors of publication | Liu, Jian-Jun; Guan, Ying-Fang; Jiao, Chen; Lin, Mei-Jin; Huang, Chang-Cang; Dai, Wen-Xin |
Journal of publication | Dalton transactions (Cambridge, England : 2003) |
Year of publication | 2015 |
Journal volume | 44 |
Journal issue | 13 |
Pages of publication | 5957 - 5960 |
a | 11.361 ± 0.002 Å |
b | 13.25 ± 0.003 Å |
c | 15.572 ± 0.003 Å |
α | 66.81 ± 0.03° |
β | 78.1 ± 0.03° |
γ | 74.92 ± 0.03° |
Cell volume | 2066.2 ± 0.9 Å3 |
Cell temperature | 293 ± 2 K |
Ambient diffraction temperature | 293 ± 2 K |
Number of distinct elements | 6 |
Space group number | 2 |
Hermann-Mauguin space group symbol | P -1 |
Hall space group symbol | -P 1 |
Residual factor for all reflections | 0.0599 |
Residual factor for significantly intense reflections | 0.0404 |
Weighted residual factors for significantly intense reflections | 0.0933 |
Weighted residual factors for all reflections included in the refinement | 0.1059 |
Goodness-of-fit parameter for all reflections included in the refinement | 1.038 |
Diffraction radiation wavelength | 0.71073 Å |
Diffraction radiation type | MoKα |