Information card for entry 7034128
Formula | C17 H21 F4 Gd N4 O10 |
Calculated formula | C17 H21 F4 Gd N4 O10 |
Title of publication | Bright luminescence in lanthanide coordination polymers with tetrafluoroterephthalate as a bridging ligand. |
Authors of publication | Sobieray, Miriam; Gode, Jens; Seidel, Christiane; Poß, Marieke; Feldmann, Claus; Ruschewitz, Uwe |
Journal of publication | Dalton transactions (Cambridge, England : 2003) |
Year of publication | 2015 |
Journal volume | 44 |
Journal issue | 13 |
Pages of publication | 6249 - 6259 |
a | 22.118 ± 0.004 Å |
b | 11.3996 ± 0.0016 Å |
c | 20.57 ± 0.004 Å |
α | 90° |
β | 111.147 ± 0.017° |
γ | 90° |
Cell volume | 4837.2 ± 1.6 Å3 |
Cell temperature | 293 ± 2 K |
Ambient diffraction temperature | 293 ± 2 K |
Number of distinct elements | 6 |
Space group number | 15 |
Hermann-Mauguin space group symbol | C 1 2/c 1 |
Hall space group symbol | -C 2yc |
Residual factor for all reflections | 0.133 |
Residual factor for significantly intense reflections | 0.0637 |
Weighted residual factors for significantly intense reflections | 0.1248 |
Weighted residual factors for all reflections included in the refinement | 0.1444 |
Goodness-of-fit parameter for all reflections included in the refinement | 0.809 |
Diffraction radiation wavelength | 0.71073 Å |
Diffraction radiation type | MoKα |