Information card for entry 7034133
Formula | C16 H21 Eu F4 N6 O12 |
Calculated formula | C16 H21 Eu F4 N6 O12 |
Title of publication | Bright luminescence in lanthanide coordination polymers with tetrafluoroterephthalate as a bridging ligand. |
Authors of publication | Sobieray, Miriam; Gode, Jens; Seidel, Christiane; Poß, Marieke; Feldmann, Claus; Ruschewitz, Uwe |
Journal of publication | Dalton transactions (Cambridge, England : 2003) |
Year of publication | 2015 |
Journal volume | 44 |
Journal issue | 13 |
Pages of publication | 6249 - 6259 |
a | 10.9465 ± 0.0005 Å |
b | 11.1155 ± 0.0005 Å |
c | 11.4684 ± 0.0005 Å |
α | 101.707 ± 0.003° |
β | 104.3 ± 0.003° |
γ | 101.651 ± 0.003° |
Cell volume | 1276.49 ± 0.11 Å3 |
Cell temperature | 293 ± 2 K |
Ambient diffraction temperature | 293 ± 2 K |
Number of distinct elements | 6 |
Space group number | 2 |
Hermann-Mauguin space group symbol | P -1 |
Hall space group symbol | -P 1 |
Residual factor for all reflections | 0.0256 |
Residual factor for significantly intense reflections | 0.0233 |
Weighted residual factors for significantly intense reflections | 0.0577 |
Weighted residual factors for all reflections included in the refinement | 0.0599 |
Goodness-of-fit parameter for all reflections included in the refinement | 1.072 |
Diffraction radiation wavelength | 0.71073 Å |
Diffraction radiation type | MoKα |