Information card for entry 7034135
Formula | C12 H12 Er F4 N O9 S2 |
Calculated formula | C12 H12 Er F4 N O9 S2 |
Title of publication | Bright luminescence in lanthanide coordination polymers with tetrafluoroterephthalate as a bridging ligand. |
Authors of publication | Sobieray, Miriam; Gode, Jens; Seidel, Christiane; Poß, Marieke; Feldmann, Claus; Ruschewitz, Uwe |
Journal of publication | Dalton transactions (Cambridge, England : 2003) |
Year of publication | 2015 |
Journal volume | 44 |
Journal issue | 13 |
Pages of publication | 6249 - 6259 |
a | 15.4177 ± 0.0013 Å |
b | 15.0482 ± 0.0009 Å |
c | 16.6749 ± 0.0011 Å |
α | 90° |
β | 90° |
γ | 90° |
Cell volume | 3868.7 ± 0.5 Å3 |
Cell temperature | 293 ± 2 K |
Ambient diffraction temperature | 293 ± 2 K |
Number of distinct elements | 7 |
Space group number | 61 |
Hermann-Mauguin space group symbol | P b c a |
Hall space group symbol | -P 2ac 2ab |
Residual factor for all reflections | 0.044 |
Residual factor for significantly intense reflections | 0.0351 |
Weighted residual factors for significantly intense reflections | 0.0889 |
Weighted residual factors for all reflections included in the refinement | 0.1013 |
Goodness-of-fit parameter for all reflections included in the refinement | 1.105 |
Diffraction radiation wavelength | 0.71073 Å |
Diffraction radiation type | MoKα |