Information card for entry 7034138
Formula | C10 H21 B9 O4 S3 W |
Calculated formula | C10 H21 B9 O4 S3 W |
SMILES | [W]1([S](C)[C]234[BH]567[BH]89%10[BH]%1125[BH]258[BH]8%129[BH]96%10[BH]%12([S](C)C)([BH]58[C]3%112[S]1C)[BH]479)(C#[O])(C#[O])(C#[O])C#[O] |
Title of publication | Tungsten carbonyl σ-complexes with charge-compensated nido-carboranyl thioether ligands. |
Authors of publication | Timofeev, Sergey V.; Zhidkova, Olga B.; Mosolova, Elena M.; Sivaev, Igor B.; Godovikov, Ivan A.; Suponitsky, Kyrill Yu; Starikova, Zoya A.; Bregadze, Vladimir I. |
Journal of publication | Dalton transactions (Cambridge, England : 2003) |
Year of publication | 2015 |
Journal volume | 44 |
Journal issue | 14 |
Pages of publication | 6449 - 6456 |
a | 27.9281 ± 0.0012 Å |
b | 9.3091 ± 0.0004 Å |
c | 8.0289 ± 0.0003 Å |
α | 90° |
β | 90° |
γ | 90° |
Cell volume | 2087.4 ± 0.15 Å3 |
Cell temperature | 120 ± 2 K |
Ambient diffraction temperature | 120 ± 2 K |
Number of distinct elements | 6 |
Space group number | 33 |
Hermann-Mauguin space group symbol | P n a 21 |
Hall space group symbol | P 2c -2n |
Residual factor for all reflections | 0.0214 |
Residual factor for significantly intense reflections | 0.0178 |
Weighted residual factors for significantly intense reflections | 0.0357 |
Weighted residual factors for all reflections included in the refinement | 0.0367 |
Goodness-of-fit parameter for all reflections included in the refinement | 0.984 |
Diffraction radiation wavelength | 0.71073 Å |
Diffraction radiation type | MoKα |