Information card for entry 7034154
Formula | C28 H34 Mn2 N4 O10 S4 |
Calculated formula | C28 H34 Mn2 N4 O10 S4 |
Title of publication | Solvent dependent reactivities of di-, tetra- and hexanuclear manganese complexes: syntheses, structures and magnetic properties. |
Authors of publication | Yang, Hua; Cao, Fan; Li, Dacheng; Zeng, Suyuan; Song, You; Dou, Jianmin |
Journal of publication | Dalton transactions (Cambridge, England : 2003) |
Year of publication | 2015 |
Journal volume | 44 |
Journal issue | 14 |
Pages of publication | 6620 - 6629 |
a | 9.2195 ± 0.0008 Å |
b | 18.7801 ± 0.0019 Å |
c | 11.0378 ± 0.0012 Å |
α | 90° |
β | 114.254 ± 0.002° |
γ | 90° |
Cell volume | 1742.4 ± 0.3 Å3 |
Cell temperature | 298 ± 2 K |
Ambient diffraction temperature | 298 ± 2 K |
Number of distinct elements | 6 |
Space group number | 14 |
Hermann-Mauguin space group symbol | P 1 21/c 1 |
Hall space group symbol | -P 2ybc |
Residual factor for all reflections | 0.0801 |
Residual factor for significantly intense reflections | 0.0555 |
Weighted residual factors for significantly intense reflections | 0.1255 |
Weighted residual factors for all reflections included in the refinement | 0.1527 |
Goodness-of-fit parameter for all reflections included in the refinement | 1.054 |
Diffraction radiation wavelength | 0.71073 Å |
Diffraction radiation type | MoKα |