Information card for entry 7034161
Formula | C59 H72.5 Br7.33 Cu9.33 N9.5 P6 |
Calculated formula | C58.68 H69.5 Br7.32 Cu9.33 N9.5 P6 |
Title of publication | Unexpected fragmentations of triphosphaferrocene - formation of supramolecular assemblies containing the (1,2,4-P3C2Mes2)(-) ligand. |
Authors of publication | Heindl, Claudia; Kuntz, Andrea; Peresypkina, Eugenia V.; Virovets, Alexander V.; Zabel, Manfred; Lüdeker, David; Brunklaus, Gunther; Scheer, Manfred |
Journal of publication | Dalton transactions (Cambridge, England : 2003) |
Year of publication | 2015 |
Journal volume | 44 |
Journal issue | 14 |
Pages of publication | 6502 - 6509 |
a | 30.3248 ± 0.0007 Å |
b | 16.9395 ± 0.0004 Å |
c | 16.0657 ± 0.0003 Å |
α | 90° |
β | 102.218 ± 0.002° |
γ | 90° |
Cell volume | 8065.8 ± 0.3 Å3 |
Cell temperature | 123 ± 2 K |
Ambient diffraction temperature | 123 ± 2 K |
Number of distinct elements | 6 |
Space group number | 15 |
Hermann-Mauguin space group symbol | C 1 2/c 1 |
Hall space group symbol | -C 2yc |
Residual factor for all reflections | 0.0752 |
Residual factor for significantly intense reflections | 0.0623 |
Weighted residual factors for significantly intense reflections | 0.1659 |
Weighted residual factors for all reflections included in the refinement | 0.1752 |
Goodness-of-fit parameter for all reflections included in the refinement | 0.968 |
Diffraction radiation wavelength | 1.54178 Å |
Diffraction radiation type | CuKα |